{"text_format":"1","workbook":"xlsx","n_sheets":3,"sheets":["割引率算出","結果点数換算表","点数割引換算表"],"not_rendered":{"charts":0,"images":1,"macros":1,"external_links":0,"defined_names":1,"comments":0,"pivot_tables":0},"unopened":[],"bounds":{"document_bytes":16777216,"sheet_cells":100000,"rows_first":2000,"rows_last":500,"rows_between":2000,"halvings":0,"cell_chars":16384,"cell_head_chars":4096},"cells_cut":0,"cells_raw":0,"read":"whole","date_system":"1900"}

{"sheet":"割引率算出","index":0,"n_rows":41,"n_cols":15,"rows_kept":41,"cut":false,"hidden":false,"merged":[[40,9,40,11],[33,2,33,3],[33,4,33,10],[34,2,34,3],[34,4,34,10],[36,9,36,11],[31,2,31,3],[31,4,31,10],[32,2,32,3],[32,4,32,10],[28,2,28,3],[28,4,28,10],[29,2,29,3],[29,4,29,10],[30,2,30,3],[30,4,30,10],[25,2,25,3],[25,4,25,10],[26,2,26,3],[26,4,26,10],[27,2,27,3],[27,4,27,10],[22,2,22,3],[22,4,22,10],[23,2,23,3],[23,4,23,10],[24,2,24,3],[24,4,24,10],[19,2,19,3],[19,4,19,10],[20,2,20,3],[20,4,20,10],[21,2,21,3],[21,4,21,10],[16,2,16,3],[16,4,16,10],[17,2,17,3],[17,4,17,10],[18,2,18,3],[18,4,18,10],[13,2,13,3],[13,4,13,10],[14,2,14,3],[14,4,14,10],[15,2,15,3],[15,4,15,10],[11,2,11,3],[11,4,11,10],[12,2,12,3],[12,4,12,10],[2,9,2,11],[9,2,9,3],[9,4,9,10],[10,2,10,3],[10,4,10,10],[4,3,4,7],[5,3,5,7],[6,3,6,7],[7,3,7,7]]}
[]
[]
[null,null,null,null,null,null,null,null,"サイバープロテクター割引率算出ツール","（2021年10月1日以降始期契約用）"]
[]
[null,null,null,"ヒアリング実施日"]
[null,null,null,"会社名"]
[null,null,null,"ヒアリング相手"]
[null,null,null,"作成者"]
[]
[null,null,"NO",null,"質問事項",null,null,null,null,null,null,"回答内容",null,null,"－－－"]
[null,null,1,null,"情報セキュリティに関わるルールや対策を定めていますか。",null,null,null,null,null,null,"－－－",null,null,"YES"]
[null,null,2,null,"情報漏洩や不正アクセスなどの情報セキュリティ事故の発生に備えて体制や手順を整備していますか。",null,null,null,null,null,null,"－－－",null,null,"NO"]
[null,null,3,null,"業務に関わる情報を、業務に関係のない人や組織に漏らさないようルール化して従業員に守らせていますか。",null,null,null,null,null,null,"－－－"]
[null,null,4,null,"情報セキュリティに関わる認証を取得していますか。",null,null,null,null,null,null,"－－－"]
[null,null,5,null,"従業員に対してセキュリティ教育などの啓発活動を実施していますか。",null,null,null,null,null,null,"－－－"]
[null,null,6,null,"インターネットを介したウイルス感染やSNSへの書き込みなどのトラブルへの対策をしていますか。",null,null,null,null,null,null,"－－－"]
[null,null,7,null,"セキュリティのルールや、セキュリティ対策の実施状況が適切かどうか確認する仕組みはありますか。",null,null,null,null,null,null,"－－－"]
[null,null,8,null,"社内のパソコンを、第三者が不正に操作できないようにしていますか？",null,null,null,null,null,null,"－－－"]
[null,null,9,null,"会社の敷地、建物内において、業務に関係のない第三者が勝手に侵入できないような対策を施していますか。",null,null,null,null,null,null,"－－－"]
[null,null,10,null,"会社で保有する情報機器（パソコン、サーバー、ネットワーク機器、電子記憶媒体）を特定しセキュリティの観点から管理していますか。",null,null,null,null,null,null,"－－－"]
[null,null,11,null,"重要な情報が記載された書類または保存されている電子記憶媒体を紛失や盗難から守る対策を行っていますか。",null,null,null,null,null,null,"－－－"]
[null,null,12,null,"業務に関わる情報を保有するパソコンや電子記憶媒体、又は記載がされた書類などは、その情報が第三者の手に渡らない方法で廃棄していますか。",null,null,null,null,null,null,"－－－"]
[null,null,13,null,"会社のネットワーク構成を文書化していますか。",null,null,null,null,null,null,"－－－"]
[null,null,14,null,"インターネットの脅威(攻撃)から会社のネットワークを守るためのセキュリティ機器を導入していますか。",null,null,null,null,null,null,"－－－"]
[null,null,15,null,"電子メールの取り扱いに関わるセキュリティルールを定めていますか。",null,null,null,null,null,null,"－－－"]
[null,null,16,null,"社内のWi-Fi(無線LAN)は、盗聴や不正利用から保護する対策を施していますか。",null,null,null,null,null,null,"－－－"]
[null,null,17,null,"会社の情報を利用する様々なツールに対するアクセス制限を行っていますか。",null,null,null,null,null,null,"－－－"]
[null,null,18,null,"パソコンや情報システムへのアクセスに利用するパスワードの利用ルールを定めていますか。",null,null,null,null,null,null,"－－－"]
[null,null,19,null,"業務で使用する携帯端末（スマートフォン・タブレット）を会社で管理し、必要なセキュリティ対策を施していますか。",null,null,null,null,null,null,"－－－"]
[null,null,20,null,"会社で使用するパソコン等の機器の内、ウィルス対策を必要とする機器にアンチウィルスソフトを導入していますか。",null,null,null,null,null,null,"－－－"]
[null,null,21,null,"業務で使用するソフトウェアを管理していますか。",null,null,null,null,null,null,"－－－"]
[null,null,22,null,"ウィルス感染等の情報セキュリティ事故やシステム障害に備えて、パソコンやサーバーに保存されている重要なデータのバックアップを取得してますか。",null,null,null,null,null,null,"－－－"]
[null,null,23,null,"セキュリティ機器のログ又は、発見されたイベントの記録を取得していますか。取る設定を有効にしていますか。",null,null,null,null,null,null,"－－－"]
[null,null,24,null,"情報機器や携帯端末などのOS（オペレーティングシステム）やソフトウェアのバージョンは常に最新の状態 にしていますか。",null,null,null,null,null,null,"－－－"]
[null,null,25,null,"セキュリティ面を考慮して、会社の情報の取り扱いを委託している外部サービス（開発ベンダー、クラウドサービスベンダー等）を管理していますか。",null,null,null,null,null,null,"－－－"]
[]
[null,null,null,null,null,null,null,null,"割引確認シートによるスコア：",{"$f":"結果点数換算表!I2","v":"error"}]
[]
[]
[]
[null,null,null,null,null,null,null,null,"割引確認シートによる割引率（最大）：",{"$f":"結果点数換算表!I3/100","v":{"$error":"#N/A"}}]

{"sheet":"結果点数換算表","index":1,"n_rows":80,"n_cols":9,"rows_kept":80,"cut":false,"hidden":true,"merged":[[77,6,79,6],[77,7,79,7],[77,8,79,8],[71,6,73,6],[71,7,73,7],[71,8,73,8],[74,6,76,6],[74,7,76,7],[74,8,76,8],[65,6,67,6],[65,7,67,7],[65,8,67,8],[68,6,70,6],[68,7,70,7],[68,8,70,8],[59,6,61,6],[59,7,61,7],[59,8,61,8],[62,6,64,6],[62,7,64,7],[62,8,64,8],[53,6,55,6],[53,7,55,7],[53,8,55,8],[56,6,58,6],[56,7,58,7],[56,8,58,8],[47,6,49,6],[47,7,49,7],[47,8,49,8],[50,6,52,6],[50,7,52,7],[50,8,52,8],[41,6,43,6],[41,7,43,7],[41,8,43,8],[44,6,46,6],[44,7,46,7],[44,8,46,8],[35,6,37,6],[35,7,37,7],[35,8,37,8],[38,6,40,6],[38,7,40,7],[38,8,40,8],[29,6,31,6],[29,7,31,7],[29,8,31,8],[32,6,34,6],[32,7,34,7],[32,8,34,8],[23,6,25,6],[23,7,25,7],[23,8,25,8],[26,6,28,6],[26,7,28,7],[26,8,28,8],[17,6,19,6],[17,7,19,7],[17,8,19,8],[20,6,22,6],[20,7,22,7],[20,8,22,8],[11,6,13,6],[11,7,13,7],[11,8,13,8],[14,6,16,6],[14,7,16,7],[14,8,16,8],[5,6,7,6],[5,7,7,7],[5,8,7,8],[8,6,10,6],[8,7,10,7],[8,8,10,8]]}
[]
[null,null,null,null,null,null,null,"総点数",{"$f":"IF(COUNTIF(I6:I80,\"error\")>=1,\"error\",SUM(I6:I80))","v":"error"}]
[null,null,null,null,null,null,null,"割引率",{"$f":"VLOOKUP(I2,点数割引換算表!$A:$B,2,FALSE)","v":{"$error":"#N/A"}}]
[null,null,"■すべてのプランについて、全項目ヒアリング対象とする。\n■わからない場合は「いいえ」を選択する想定。"]
[null,"No.","","","","","","",""]
[null,1,"情報セキュリティに関わるルールや対策を定めていますか。","－－－",1,"error",{"$f":"VLOOKUP(割引率算出!L11,結果点数換算表!D6:E8,2,0)","v":1},{"$f":"IF(G6<>1,TRUE,FALSE)","v":false},{"$f":"VLOOKUP(G6,E6:F8,2,FALSE)","v":"error"}]
[null,null,null,"YES",2,20]
[null,null,null,"NO",3,0]
[null,2,"情報漏洩や不正アクセスなどの情報セキュリティ事故の発生に備えて体制や手順を整備していますか。","－－－",1,"error",{"$f":"VLOOKUP(割引率算出!L12,D9:E11,2,0)","v":1},{"$f":"IF(G9<>1,TRUE,FALSE)","v":false},{"$f":"VLOOKUP(G9,E9:F11,2,FALSE)","v":"error"}]
[null,null,null,"YES",2,53]
[null,null,null,"NO",3,0]
[null,3,"業務に関わる情報を、業務に関係のない人や組織に漏らさないようルール化して従業員に守らせていますか。","－－－",1,"error",{"$f":"VLOOKUP(割引率算出!L13,結果点数換算表!D12:E14,2,0)","v":1},{"$f":"IF(G12<>1,TRUE,FALSE)","v":false},{"$f":"VLOOKUP(G12,E12:F14,2,FALSE)","v":"error"}]
[null,null,null,"YES",2,26]
[null,null,null,"NO",3,0]
[null,4,"情報セキュリティに関わる認証を取得していますか。","－－－",1,"error",{"$f":"VLOOKUP(割引率算出!L14,D15:E17,2,0)","v":1},{"$f":"IF(G15<>1,TRUE,FALSE)","v":false},{"$f":"VLOOKUP(G15,E15:F17,2,FALSE)","v":"error"}]
[null,null,null,"YES",2,60]
[null,null,null,"NO",3,0]
[null,5,"従業員に対してセキュリティ教育などの啓発活動を実施していますか。","－－－",1,"error",{"$f":"VLOOKUP(割引率算出!L15,D18:E20,2,0)","v":1},{"$f":"IF(G18<>1,TRUE,FALSE)","v":false},{"$f":"VLOOKUP(G18,E18:F20,2,FALSE)","v":"error"}]
[null,null,null,"YES",2,26]
[null,null,null,"NO",3,0]
[null,6,"インターネットを介したウイルス感染やSNSへの書き込みなどのトラブルへの対策をしていますか。","－－－",1,"error",{"$f":"VLOOKUP(割引率算出!L16,D21:E23,2,0)","v":1},{"$f":"IF(G21<>1,TRUE,FALSE)","v":false},{"$f":"VLOOKUP(G21,E21:F23,2,FALSE)","v":"error"}]
[null,null,null,"YES",2,36]
[null,null,null,"NO",3,0]
[null,7,"セキュリティのルールや、セキュリティ対策の実施状況が適切かどうか確認する仕組みはありますか。","－－－",1,"error",{"$f":"VLOOKUP(割引率算出!L17,結果点数換算表!D24:E26,2,0)","v":1},{"$f":"IF(G24<>1,TRUE,FALSE)","v":false},{"$f":"VLOOKUP(G24,E24:F26,2,FALSE)","v":"error"}]
[null,null,null,"YES",2,60]
[null,null,null,"NO",3,0]
[null,8,"社内のパソコンを、第三者が不正に操作できないようにしていますか？","－－－",1,"error",{"$f":"VLOOKUP(割引率算出!L18,D27:E29,2,0)","v":1},{"$f":"IF(G27<>1,TRUE,FALSE)","v":false},{"$f":"VLOOKUP(G27,E27:F29,2,FALSE)","v":"error"}]
[null,null,null,"YES",2,28]
[null,null,null,"NO",3,0]
[null,9,"会社の敷地、建物内において、業務に関係のない第三者が勝手に侵入できないような対策を施していますか。","－－－",1,"error",{"$f":"VLOOKUP(割引率算出!L19,結果点数換算表!D30:E32,2,0)","v":1},{"$f":"IF(G30<>1,TRUE,FALSE)","v":false},{"$f":"VLOOKUP(G30,E30:F32,2,FALSE)","v":"error"}]
[null,null,null,"YES",2,86]
[null,null,null,"NO",3,0]
[null,10,"会社で保有する情報機器（パソコン、サーバー、ネットワーク機器、電子記憶媒体）を特定しセキュリティの観点から管理していますか。","－－－",1,"error",{"$f":"VLOOKUP(割引率算出!L20,D33:E35,2,0)","v":1},{"$f":"IF(G33<>1,TRUE,FALSE)","v":false},{"$f":"VLOOKUP(G33,E33:F35,2,FALSE)","v":"error"}]
[null,null,null,"YES",2,42]
[null,null,null,"NO",3,0]
[null,11,"重要な情報が記載された書類または保存されている電子記憶媒体を紛失や盗難から守る対策を行っていますか。","－－－",1,"error",{"$f":"VLOOKUP(割引率算出!L21,結果点数換算表!D36:E38,2,0)","v":1},{"$f":"IF(G36<>1,TRUE,FALSE)","v":false},{"$f":"VLOOKUP(G36,E36:F38,2,FALSE)","v":"error"}]
[null,null,null,"YES",2,26]
[null,null,null,"NO",3,0]
[null,12,"業務に関わる情報を保有するパソコンや電子記憶媒体、又は記載がされた書類などは、その情報が第三者の手に渡らない方法で廃棄していますか。","－－－",1,"error",{"$f":"VLOOKUP(割引率算出!L22,結果点数換算表!D39:E41,2,0)","v":1},{"$f":"IF(G39<>1,TRUE,FALSE)","v":false},{"$f":"VLOOKUP(G39,E39:F41,2,FALSE)","v":"error"}]
[null,null,null,"YES",2,26]
[null,null,null,"NO",3,0]
[null,13,"会社のネットワーク構成を文書化していますか。","－－－",1,"error",{"$f":"VLOOKUP(割引率算出!L23,結果点数換算表!D42:E44,2,0)","v":1},{"$f":"IF(G42<>1,TRUE,FALSE)","v":false},{"$f":"VLOOKUP(G42,E42:F44,2,FALSE)","v":"error"}]
[null,null,null,"YES",2,6]
[null,null,null,"NO",3,0]
[null,14,"インターネットの脅威(攻撃)から会社のネットワークを守るためのセキュリティ機器を導入していますか。","－－－",1,"error",{"$f":"VLOOKUP(割引率算出!L24,結果点数換算表!D45:E47,2,0)","v":1},{"$f":"IF(G45<>1,TRUE,FALSE)","v":false},{"$f":"VLOOKUP(G45,E45:F47,2,FALSE)","v":"error"}]
[null,null,null,"YES",2,86]
[null,null,null,"NO",3,0]
[null,15,"電子メールの取り扱いに関わるセキュリティルールを定めていますか。","－－－",1,"error",{"$f":"VLOOKUP(割引率算出!L25,D48:E50,2,0)","v":1},{"$f":"IF(G48<>1,TRUE,FALSE)","v":false},{"$f":"VLOOKUP(G48,E48:F50,2,FALSE)","v":"error"}]
[null,null,null,"YES",2,34]
[null,null,null,"NO",3,0]
[null,16,"社内のWi-Fi(無線LAN)は、盗聴や不正利用から保護する対策を施していますか。","－－－",1,"error",{"$f":"VLOOKUP(割引率算出!L26,D51:E53,2,0)","v":1},{"$f":"IF(G51<>1,TRUE,FALSE)","v":false},{"$f":"VLOOKUP(G51,E51:F53,2,FALSE)","v":"error"}]
[null,null,null,"YES",2,33]
[null,null,null,"NO",3,0]
[null,17,"会社の情報を利用する様々なツールに対するアクセス制限を行っていますか。","－－－",1,"error",{"$f":"VLOOKUP(割引率算出!L27,結果点数換算表!D54:E56,2,0)","v":1},{"$f":"IF(G54<>1,TRUE,FALSE)","v":false},{"$f":"VLOOKUP(G54,E54:F56,2,FALSE)","v":"error"}]
[null,null,null,"YES",2,86]
[null,null,null,"NO",3,0]
[null,18,"パソコンや情報システムへのアクセスに利用するパスワードの利用ルールを定めていますか。","－－－",1,"error",{"$f":"VLOOKUP(割引率算出!L28,D57:E59,2,0)","v":1},{"$f":"IF(G57<>1,TRUE,FALSE)","v":false},{"$f":"VLOOKUP(G57,E57:F59,2,FALSE)","v":"error"}]
[null,null,null,"YES",2,6]
[null,null,null,"NO",3,0]
[null,19,"業務で使用する携帯端末（スマートフォン・タブレット）を会社で管理し、必要なセキュリティ対策を施していますか。","－－－",1,"error",{"$f":"VLOOKUP(割引率算出!L29,D60:E62,2,0)","v":1},{"$f":"IF(G60<>1,TRUE,FALSE)","v":false},{"$f":"VLOOKUP(G60,E60:F62,2,FALSE)","v":"error"}]
[null,null,null,"YES",2,27]
[null,null,null,"NO",3,0]
[null,20,"会社で使用するパソコン等の機器の内、ウィルス対策を必要とする機器にアンチウィルスソフトを導入していますか。","－－－",1,"error",{"$f":"VLOOKUP(割引率算出!L30,結果点数換算表!D63:E65,2,0)","v":1},{"$f":"IF(G63<>1,TRUE,FALSE)","v":false},{"$f":"VLOOKUP(G63,E63:F65,2,FALSE)","v":"error"}]
[null,null,null,"YES",2,15]
[null,null,null,"NO",3,0]
[null,21,"業務で使用するソフトウェアを管理していますか。","－－－",1,"error",{"$f":"VLOOKUP(割引率算出!L31,結果点数換算表!D66:E68,2,0)","v":1},{"$f":"IF(G66<>1,TRUE,FALSE)","v":false},{"$f":"VLOOKUP(G66,E66:F68,2,FALSE)","v":"error"}]
[null,null,null,"YES",2,46]
[null,null,null,"NO",3,0]
[null,22,"ウィルス感染等の情報セキュリティ事故やシステム障害に備えて、パソコンやサーバーに保存されている重要なデータのバックアップを取得してますか。","－－－",1,"error",{"$f":"VLOOKUP(割引率算出!L32,結果点数換算表!D69:E71,2,0)","v":1},{"$f":"IF(G69<>1,TRUE,FALSE)","v":false},{"$f":"VLOOKUP(G69,E69:F71,2,FALSE)","v":"error"}]
[null,null,null,"YES",2,26]
[null,null,null,"NO",3,0]
[null,23,"セキュリティ機器のログ又は、発見されたイベントの記録を取得していますか。取る設定を有効にしていますか。","－－－",1,"error",{"$f":"VLOOKUP(割引率算出!L33,結果点数換算表!D72:E74,2,0)","v":1},{"$f":"IF(G72<>1,TRUE,FALSE)","v":false},{"$f":"VLOOKUP(G72,E72:F74,2,FALSE)","v":"error"}]
[null,null,null,"YES",2,33]
[null,null,null,"NO",3,0]
[null,24,"情報機器や携帯端末などのOS（オペレーティングシステム）やソフトウェアのバージョンは常に最新の状態 にしていますか。","－－－",1,"error",{"$f":"VLOOKUP(割引率算出!L34,結果点数換算表!D75:E77,2,0)","v":1},{"$f":"IF(G75<>1,TRUE,FALSE)","v":false},{"$f":"VLOOKUP(G75,E75:F77,2,FALSE)","v":"error"}]
[null,null,null,"YES",2,53]
[null,null,null,"NO",3,0]
[null,25,"セキュリティ面を考慮して、会社の情報の取り扱いを委託している外部サービス（開発ベンダー、クラウドサービスベンダー等）を管理していますか。","－－－",1,"error",{"$f":"VLOOKUP(割引率算出!L35,結果点数換算表!D78:E80,2,0)","v":1},{"$f":"IF(G78<>1,TRUE,FALSE)","v":false},{"$f":"VLOOKUP(G78,E78:F80,2,FALSE)","v":"error"}]
[null,null,null,"YES",2,60]
[null,null,null,"NO",3,0]

{"sheet":"点数割引換算表","index":2,"n_rows":1004,"n_cols":3,"rows_kept":1004,"cut":false,"hidden":true,"merged":[]}
[]
[null,null,"↓計算式「規定割引」のこと"]
["割引確認シートによるスコア","割引確認シートによる最大割引率\n（％）","割引確認シートによる適用割引（％）\n※MSは左記の範囲内でユーザー入力。\n※ADは左記の値を自動セット"]
[0,0,0]
[1,0,0]
[2,0,0]
[3,0,0]
[4,0,0]
[5,0,0]
[6,0,0]
[7,0,0]
[8,0,0]
[9,0,0]
[10,0,0]
[11,0,0]
[12,0,0]
[13,0,0]
[14,0,0]
[15,0,0]
[16,0,0]
[17,0,0]
[18,0,0]
[19,0,0]
[20,0,0]
[21,0,0]
[22,0,0]
[23,0,0]
[24,0,0]
[25,0,0]
[26,0,0]
[27,0,0]
[28,0,0]
[29,0,0]
[30,0,0]
[31,0,0]
[32,0,0]
[33,0,0]
[34,0,0]
[35,0,0]
[36,0,0]
[37,0,0]
[38,0,0]
[39,0,0]
[40,0,0]
[41,0,0]
[42,0,0]
[43,0,0]
[44,0,0]
[45,0,0]
[46,0,0]
[47,0,0]
[48,0,0]
[49,0,0]
[50,0,0]
[51,0,0]
[52,0,0]
[53,0,0]
[54,0,0]
[55,0,0]
[56,0,0]
[57,0,0]
[58,0,0]
[59,0,0]
[60,0,0]
[61,0,0]
[62,0,0]
[63,0,0]
[64,0,0]
[65,0,0]
[66,0,0]
[67,0,0]
[68,0,0]
[69,0,0]
[70,0,0]
[71,0,0]
[72,0,0]
[73,0,0]
[74,0,0]
[75,0,0]
[76,0,0]
[77,0,0]
[78,0,0]
[79,0,0]
[80,0,0]
[81,0,0]
[82,0,0]
[83,0,0]
[84,0,0]
[85,0,0]
[86,0,0]
[87,0,0]
[88,0,0]
[89,0,0]
[90,0,0]
[91,0,0]
[92,0,0]
[93,0,0]
[94,0,0]
[95,0,0]
[96,0,0]
[97,0,0]
[98,0,0]
[99,0,0]
[100,0,0]
[101,0,0]
[102,0,0]
[103,0,0]
[104,0,0]
[105,0,0]
[106,0,0]
[107,0,0]
[108,0,0]
[109,0,0]
[110,0,0]
[111,0,0]
[112,0,0]
[113,0,0]
[114,0,0]
[115,0,0]
[116,0,0]
[117,0,0]
[118,0,0]
[119,0,0]
[120,0,0]
[121,0,0]
[122,0,0]
[123,0,0]
[124,0,0]
[125,0,0]
[126,0,0]
[127,0,0]
[128,0,0]
[129,0,0]
[130,0,0]
[131,0,0]
[132,0,0]
[133,0,0]
[134,0,0]
[135,0,0]
[136,0,0]
[137,0,0]
[138,0,0]
[139,0,0]
[140,0,0]
[141,0,0]
[142,0,0]
[143,0,0]
[144,0,0]
[145,0,0]
[146,0,0]
[147,0,0]
[148,0,0]
[149,0,0]
[150,0,0]
[151,0,0]
[152,0,0]
[153,0,0]
[154,0,0]
[155,0,0]
[156,0,0]
[157,0,0]
[158,0,0]
[159,0,0]
[160,0,0]
[161,0,0]
[162,0,0]
[163,0,0]
[164,0,0]
[165,0,0]
[166,0,0]
[167,0,0]
[168,0,0]
[169,0,0]
[170,0,0]
[171,0,0]
[172,0,0]
[173,0,0]
[174,0,0]
[175,0,0]
[176,0,0]
[177,0,0]
[178,0,0]
[179,0,0]
[180,0,0]
[181,0,0]
[182,0,0]
[183,0,0]
[184,0,0]
[185,0,0]
[186,0,0]
[187,0,0]
[188,0,0]
[189,0,0]
[190,0,0]
[191,0,0]
[192,0,0]
[193,0,0]
[194,0,0]
[195,0,0]
[196,0,0]
[197,0,0]
[198,0,0]
[199,0,0]
[200,0,0]
[201,0,0]
[202,0,0]
[203,0,0]
[204,0,0]
[205,0,0]
[206,0,0]
[207,0,0]
[208,0,0]
[209,0,0]
[210,0,0]
[211,0,0]
[212,0,0]
[213,0,0]
[214,0,0]
[215,0,0]
[216,0,0]
[217,0,0]
[218,0,0]
[219,0,0]
[220,0,0]
[221,0,0]
[222,0,0]
[223,0,0]
[224,0,0]
[225,0,0]
[226,0,0]
[227,0,0]
[228,0,0]
[229,0,0]
[230,0,0]
[231,0,0]
[232,0,0]
[233,0,0]
[234,0,0]
[235,0,0]
[236,0,0]
[237,0,0]
[238,0,0]
[239,0,0]
[240,0,0]
[241,0,0]
[242,0,0]
[243,0,0]
[244,0,0]
[245,0,0]
[246,0,0]
[247,0,0]
[248,0,0]
[249,0,0]
[250,0,0]
[251,0,0]
[252,0,0]
[253,0,0]
[254,0,0]
[255,0,0]
[256,0,0]
[257,0,0]
[258,0,0]
[259,0,0]
[260,0,0]
[261,0,0]
[262,0,0]
[263,0,0]
[264,0,0]
[265,0,0]
[266,0,0]
[267,0,0]
[268,0,0]
[269,0,0]
[270,0,0]
[271,0,0]
[272,0,0]
[273,0,0]
[274,0,0]
[275,0,0]
[276,0,0]
[277,0,0]
[278,0,0]
[279,0,0]
[280,0,0]
[281,0,0]
[282,0,0]
[283,0,0]
[284,0,0]
[285,0,0]
[286,0,0]
[287,0,0]
[288,0,0]
[289,0,0]
[290,0,0]
[291,0,0]
[292,0,0]
[293,0,0]
[294,0,0]
[295,0,0]
[296,0,0]
[297,0,0]
[298,0,0]
[299,0,0]
[300,0,0]
[301,0,0]
[302,0,0]
[303,0,0]
[304,0,0]
[305,0,0]
[306,0,0]
[307,0,0]
[308,0,0]
[309,0,0]
[310,0,0]
[311,0,0]
[312,0,0]
[313,0,0]
[314,0,0]
[315,0,0]
[316,0,0]
[317,0,0]
[318,0,0]
[319,0,0]
[320,0,0]
[321,0,0]
[322,0,0]
[323,0,0]
[324,0,0]
[325,0,0]
[326,0,0]
[327,0,0]
[328,0,0]
[329,0,0]
[330,0,0]
[331,0,0]
[332,0,0]
[333,0,0]
[334,0,0]
[335,0,0]
[336,0,0]
[337,0,0]
[338,0,0]
[339,0,0]
[340,0,0]
[341,0,0]
[342,0,0]
[343,0,0]
[344,0,0]
[345,0,0]
[346,0,0]
[347,0,0]
[348,0,0]
[349,0,0]
[350,0,0]
[351,0,0]
[352,0,0]
[353,0,0]
[354,0,0]
[355,0,0]
[356,0,0]
[357,0,0]
[358,0,0]
[359,0,0]
[360,0,0]
[361,0,0]
[362,0,0]
[363,0,0]
[364,0,0]
[365,0,0]
[366,0,0]
[367,0,0]
[368,0,0]
[369,0,0]
[370,0,0]
[371,0,0]
[372,0,0]
[373,0,0]
[374,0,0]
[375,0,0]
[376,0,0]
[377,0,0]
[378,0,0]
[379,0,0]
[380,0,0]
[381,0,0]
[382,9.9999999999999982,9.9999999999999982]
[383,9.9999999999999982,9.9999999999999982]
[384,9.9999999999999982,9.9999999999999982]
[385,9.9999999999999982,9.9999999999999982]
[386,9.9999999999999982,9.9999999999999982]
[387,9.9999999999999982,9.9999999999999982]
[388,9.9999999999999982,9.9999999999999982]
[389,9.9999999999999982,9.9999999999999982]
[390,9.9999999999999982,9.9999999999999982]
[391,9.9999999999999982,9.9999999999999982]
[392,9.9999999999999982,9.9999999999999982]
[393,9.9999999999999982,9.9999999999999982]
[394,9.9999999999999982,9.9999999999999982]
[395,9.9999999999999982,9.9999999999999982]
[396,9.9999999999999982,9.9999999999999982]
{"$rows_left_out":604}